Target
Autoinducer 2-binding periplasmic protein LuxP
Ligand
BDBM50165862
Substrate
Meas. Tech.
ChEMBL_799871 (CHEMBL1941577)
EC50
30000±n/a nM
Citation
 Rui, FMarques, JCMiller, STMaycock, CDXavier, KBVentura, MR Stereochemical diversity of AI-2 analogs modulates quorum sensing in Vibrio harveyi and Escherichia coli. Bioorg Med Chem 20:249-56 (2011)  
Target
Name:
Autoinducer 2-binding periplasmic protein LuxP
Synonyms:
LUXP_VIBHA | luxP
Type:
PROTEIN
Mol. Mass.:
41453.75
Organism:
Vibrio harveyi
Description:
ChEMBL_1513759
Residue:
365
  
Inhibitor
Name:
BDBM50165862
Synonyms:
(4S)-4,5-dihydroxypentane-2,3-dione 4,5-Dihydroxy-2,3-pentanedione CHEMBL194166
Type:
Small organic molecule
Emp. Form.:
C5H8O4
Mol. Mass.:
132.1146
SMILES:
CC(O)C(=O)C(=O)CO
: