Target
Corticotropin-releasing factor receptor 1
Ligand
BDBM50362273
Substrate
Meas. Tech.
ChEMBL_798647 (CHEMBL1942636)
IC50
4.9±n/a nM
Citation
 Saito, TObitsu, TKohno, HSugimoto, IMatsushita, TNishiyama, THirota, TTakeda, HMatsumura, NUeno, SKishi, AKagamiishi, YNakai, HTakaoka, Y Pyrrolo[1,2-b]pyridazines, pyrrolo[2,1-f]triazin-4(3H)-ones, and related compounds as novel corticotropin-releasing factor 1 (CRF¿?) receptor antagonists. Bioorg Med Chem 20:1122-38 (2012)  
Target
Name:
Corticotropin-releasing factor receptor 1
Synonyms:
CRF-R CRF1 CRFR1 CRH-R 1 CRHR1 Corticotropin-releasing factor receptor 1 (CRF-1) Corticotropin-releasing hormone receptor 1
Type:
Enzyme
Mol. Mass.:
50744.31
Organism:
Homo sapiens (Human)
Description:
P34998
Residue:
444
  
Inhibitor
Name:
BDBM50362273
Synonyms:
CHEMBL1939597
Type:
Small organic molecule
Emp. Form.:
C19H22ClN3O2
Mol. Mass.:
359.85
SMILES:
CCC(C)c1cc(C)n2nc(-c3ccc(OC)cc3Cl)n(C)c(=O)c12
: