Target
Delta-type opioid receptor
Ligand
BDBM50362299
Substrate
Meas. Tech.
ChEMBL_797688 (CHEMBL1943908)
IC50
0.094000±n/a nM
Citation
 McCauley, JPDantzman, CLKing, MMErnst, GEWang, XBrush, KPalmer, WEFrietze, WAndisik, DWHoesch, VDoring, KHulsizer, JBui, KHLiu, JHudzik, TJWesolowski, SS Multiparameter exploration of piperazine derivatives asd-opioid receptor agonists for CNS indications. Bioorg Med Chem Lett 22:1169-73 (2012)  
Target
Name:
Delta-type opioid receptor
Synonyms:
D-OR-1 Delta opioid receptor OPIATE Delta OPRD1 OPRK1 | opioid receptor, delta 1
Type:
G Protein-Coupled Receptor (GPCR)
Mol. Mass.:
40382.98
Organism:
Homo sapiens (Human)
Description:
Competition binding assays were carried out using membrane preparations from transfected HN9.10 cells that constitutively expressed the delta opioid receptor.
Residue:
372
  
Inhibitor
Name:
BDBM50362299
Synonyms:
CHEMBL1939751
Type:
Small organic molecule
Emp. Form.:
C27H33N5O3S
Mol. Mass.:
507.648
SMILES:
CCN(C)C(=O)c1ccc(cc1)[C@@H](N1CCN(Cc2cscn2)CC1)c1cccc(NC(=O)OC)c1
: