Target
Delta-type opioid receptor
Ligand
BDBM50363348
Substrate
Meas. Tech.
ChEMBL_801265 (CHEMBL1947328)
IC50
0.280000±n/a nM
Citation
 Dantzman, CLKing, MMErnst, GEWang, XMcCauley, JPAndisik, DWBrush, KBui, KHFrietze, WHoesch, VLiu, JPalmer, WESpear, NHudzik, TJWesolowski, SS 4-Piperidin-4-ylidenemethyl-benzamides asd-opioid receptor agonists for CNS indications: identifying clinical candidates. Bioorg Med Chem Lett 22:1174-8 (2012)  
Target
Name:
Delta-type opioid receptor
Synonyms:
D-OR-1 Delta opioid receptor OPIATE Delta OPRD1 OPRK1 | opioid receptor, delta 1
Type:
G Protein-Coupled Receptor (GPCR)
Mol. Mass.:
40382.98
Organism:
Homo sapiens (Human)
Description:
Competition binding assays were carried out using membrane preparations from transfected HN9.10 cells that constitutively expressed the delta opioid receptor.
Residue:
372
  
Inhibitor
Name:
BDBM50363348
Synonyms:
CHEMBL1946618
Type:
Small organic molecule
Emp. Form.:
C29H30N4O2S
Mol. Mass.:
498.639
SMILES:
[#6]-[#7](-[#6]-[#6]-[#8])-[#6](=O)-c1ccc(cc1)-[#6](=[#6]-1/[#6]-[#6]-[#7](-[#6]-c2cscn2)-[#6]-[#6]-1)\c1cccc2cccnc12
: