Target
Delta-type opioid receptor
Ligand
BDBM50363336
Substrate
Meas. Tech.
ChEMBL_801265 (CHEMBL1947328)
IC50
0.250000±n/a nM
Citation
 Dantzman, CLKing, MMErnst, GEWang, XMcCauley, JPAndisik, DWBrush, KBui, KHFrietze, WHoesch, VLiu, JPalmer, WESpear, NHudzik, TJWesolowski, SS 4-Piperidin-4-ylidenemethyl-benzamides asd-opioid receptor agonists for CNS indications: identifying clinical candidates. Bioorg Med Chem Lett 22:1174-8 (2012)  
Target
Name:
Delta-type opioid receptor
Synonyms:
D-OR-1 Delta opioid receptor OPIATE Delta OPRD1 OPRK1 | opioid receptor, delta 1
Type:
G Protein-Coupled Receptor (GPCR)
Mol. Mass.:
40382.98
Organism:
Homo sapiens (Human)
Description:
Competition binding assays were carried out using membrane preparations from transfected HN9.10 cells that constitutively expressed the delta opioid receptor.
Residue:
372
  
Inhibitor
Name:
BDBM50363336
Synonyms:
CHEMBL1946021
Type:
Small organic molecule
Emp. Form.:
C32H36FN3O2
Mol. Mass.:
513.6455
SMILES:
[#6]-[#6]-[#7](-[#6]-[#6])-[#6](=O)-c1ccc(cc1)-[#6](=[#6]-1/[#6]-[#6]-[#7](-[#6]-c2ccc(F)cc2)-[#6]-[#6]-1)\c1ccc(-[#7]-[#6](-[#6])=O)cc1
: