Target
Serine/threonine-protein kinase Chk1
Ligand
BDBM50363645
Substrate
Meas. Tech.
ChEMBL_801824 (CHEMBL1947436)
IC50
725±n/a nM
Citation
 Saleem, RSLansdell, TATepe, JJ Synthesis and evaluation of debromohymenialdisine-derived Chk2 inhibitors. Bioorg Med Chem 20:1475-81 (2012)  
Target
Name:
Serine/threonine-protein kinase Chk1
Synonyms:
CHEK1 CHK1 checkpoint homolog Checkpoint kinase-1 (CHK1)
Type:
Enzyme Catalytic Domain
Mol. Mass.:
54443.02
Organism:
Homo sapiens (Human)
Description:
gi_166295192
Residue:
476
  
Inhibitor
Name:
BDBM50363645
Synonyms:
Type:
Small organic molecule
Emp. Form.:
C11H11N5O2
Mol. Mass.:
245.2373
SMILES:
NC1=NC(C(=O)N1)=C1CCNC(=O)c2[nH]ccc12
: