Target
5-hydroxytryptamine receptor 1A
Ligand
BDBM25874
Substrate
Meas. Tech.
ChEMBL_802189 (CHEMBL1949347)
Ki
39±n/a nM
Citation
 Jaronczyk, MWolosewicz, KGabrielsen, MNowak, GKufareva, IMazurek, APRavna, AWAbagyan, RBojarski, AJSylte, IChilmonczyk, Z Synthesis, in vitro binding studies and docking of long-chain arylpiperazine nitroquipazine analogues, as potential serotonin transporter inhibitors. Eur J Med Chem 49:200-10 (2012)  
Target
Name:
5-hydroxytryptamine receptor 1A
Synonyms:
5-HT-1A 5-hydroxytryptamine receptor 1A (5-HT-1A) ADRB2RL1 Dopamine D2 receptor and serotonin 1a receptor HTR1A | Serotonin receptor 1A
Type:
Mol. Mass.:
46122.49
Organism:
Homo sapiens (Human)
Description:
Residue:
422
  
Inhibitor
Name:
BDBM25874
Synonyms:
2-{4-[4-(quinolin-2-yl)piperazin-1-yl]butyl}-2,3-dihydro-1H-isoindole-1,3-dione | buspirone analogue, 5
Type:
Small organic molecule
Emp. Form.:
C25H26N4O2
Mol. Mass.:
414.4995
SMILES:
O=C1N(CCCCN2CCN(CC2)c2ccc3ccccc3n2)C(=O)c2ccccc12
: