Target
Prostaglandin D2 receptor 2
Ligand
BDBM50363935
Substrate
Meas. Tech.
ChEMBL_805475 (CHEMBL1955368)
IC50
3±n/a nM
Citation
 Liu, JLi, ARWang, YJohnson, MGSu, YShen, WWang, XLively, SBrown, MLai, SGonzalez Lopez De Turiso, FXu, QVan Lengerich, BSchmitt, MFu, ZSun, YLawlis, SSeitz, LDanao, JWait, JYe, QTang, HLGrillo, MCollins, TLSullivan, TJMedina, JC Discovery of AMG 853, a CRTH2 and DP Dual Antagonist. ACS Med Chem Lett 2:326-330 (2011)  
Target
Name:
Prostaglandin D2 receptor 2
Synonyms:
CD_antigen=CD294 Chemoattractant Receptor-homologous molecule expressed on T-helper type 2 cells (CRTH2) Chemoattractant receptor-homologous molecule expressed on Th2 cells (CRTH2) G protein-coupled receptor 44 GPR44 PTGDR2 Prostaglandin D2 receptor 2 | Prostaglandin D2 receptor 2 (PGD2)
Type:
Enzyme
Mol. Mass.:
43295.45
Organism:
Homo sapiens (Human)
Description:
Q9Y5Y4
Residue:
395
  
Inhibitor
Name:
BDBM50363935
Synonyms:
CHEMBL1951562
Type:
Small organic molecule
Emp. Form.:
C26H26Cl2N2O6S
Mol. Mass.:
565.465
SMILES:
CCCCNC(=O)c1ccc(Oc2ccc(CC(O)=O)cc2C)c(NS(=O)(=O)c2ccc(Cl)cc2Cl)c1
: