Target
Prostaglandin D2 receptor
Ligand
BDBM50363934
Substrate
Meas. Tech.
ChEMBL_805477 (CHEMBL1955370)
IC50
21±n/a nM
Citation
 Liu, JLi, ARWang, YJohnson, MGSu, YShen, WWang, XLively, SBrown, MLai, SGonzalez Lopez De Turiso, FXu, QVan Lengerich, BSchmitt, MFu, ZSun, YLawlis, SSeitz, LDanao, JWait, JYe, QTang, HLGrillo, MCollins, TLSullivan, TJMedina, JC Discovery of AMG 853, a CRTH2 and DP Dual Antagonist. ACS Med Chem Lett 2:326-330 (2011)  
Target
Name:
Prostaglandin D2 receptor
Synonyms:
PD2R_HUMAN Prostaglandin D2 Prostanoid DP receptor
Type:
Enzyme
Mol. Mass.:
40288.87
Organism:
Homo sapiens (Human)
Description:
Q13258
Residue:
359
  
Inhibitor
Name:
BDBM50363934
Synonyms:
CHEMBL1951561
Type:
Small organic molecule
Emp. Form.:
C27H26ClF3N2O7S
Mol. Mass.:
615.018
SMILES:
CCCCNC(=O)c1ccc(Oc2ccc(CC(O)=O)cc2OC)c(NS(=O)(=O)c2ccc(cc2Cl)C(F)(F)F)c1
: