Target
Prostaglandin D2 receptor
Ligand
BDBM50363918
Substrate
Meas. Tech.
ChEMBL_805477 (CHEMBL1955370)
IC50
14±n/a nM
Citation
 Liu, JLi, ARWang, YJohnson, MGSu, YShen, WWang, XLively, SBrown, MLai, SGonzalez Lopez De Turiso, FXu, QVan Lengerich, BSchmitt, MFu, ZSun, YLawlis, SSeitz, LDanao, JWait, JYe, QTang, HLGrillo, MCollins, TLSullivan, TJMedina, JC Discovery of AMG 853, a CRTH2 and DP Dual Antagonist. ACS Med Chem Lett 2:326-330 (2011)  
Target
Name:
Prostaglandin D2 receptor
Synonyms:
PD2R_HUMAN Prostaglandin D2 Prostanoid DP receptor
Type:
Enzyme
Mol. Mass.:
40288.87
Organism:
Homo sapiens (Human)
Description:
Q13258
Residue:
359
  
Inhibitor
Name:
BDBM50363918
Synonyms:
CHEMBL1951567
Type:
Small organic molecule
Emp. Form.:
C24H19Cl3N2O6S
Mol. Mass.:
569.841
SMILES:
OC(=O)Cc1ccc(Oc2ccc(cc2NS(=O)(=O)c2ccc(Cl)cc2Cl)C(=O)NC2CC2)c(Cl)c1
: