Target
Transient receptor potential cation channel subfamily A member 1
Ligand
BDBM50203072
Substrate
Meas. Tech.
ChEMBL_802414 (CHEMBL1954857)
EC50
2500±n/a nM
Citation
 Morera, EDe Petrocellis, LMorera, LMoriello, ASNalli, MDi Marzo, VOrtar, G Synthesis and biological evaluation of [6]-gingerol analogues as transient receptor potential channel TRPV1 and TRPA1 modulators. Bioorg Med Chem Lett 22:1674-7 (2012)  
Target
Name:
Transient receptor potential cation channel subfamily A member 1
Synonyms:
Anktm1 Trpa1
Type:
PROTEIN
Mol. Mass.:
128622.74
Organism:
Rattus norvegicus
Description:
ChEMBL_1450487
Residue:
1125
  
Inhibitor
Name:
BDBM50203072
Synonyms:
3-isothiocyanatoprop-1-ene Allylisothiocyanate | CHEMBL233248
Type:
Small organic molecule
Emp. Form.:
C4H5NS
Mol. Mass.:
99.154
SMILES:
C=CCN=C=S
: