Target
Insulin receptor
Ligand
BDBM50365217
Substrate
Meas. Tech.
ChEMBL_807032 (CHEMBL1959424)
IC50
24000000±n/a nM
Citation
 Burgess, AWigan, MGiles, NDepinto, WGillespie, PStevens, FGabrielli, B Inhibition of S/G2 phase CDK4 reduces mitotic fidelity. J Biol Chem 281:9987-95 (2006)  
Target
Name:
Insulin receptor
Synonyms:
INSR INSR_HUMAN Insulin receptor beta subunit
Type:
Receptor Tyrosine Kinase
Mol. Mass.:
156322.60
Organism:
Homo sapiens (Human)
Description:
P06213
Residue:
1382
  
Inhibitor
Name:
BDBM50365217
Synonyms:
CHEMBL1956069
Type:
Small organic molecule
Emp. Form.:
C24H29N5O2S
Mol. Mass.:
451.584
SMILES:
COc1cccc(c1)C(=O)c1sc(Nc2ccc(cc2)N2CCN(CC2)C(C)C)nc1N
: