Target
Hepatocyte growth factor receptor
Ligand
BDBM50365217
Substrate
Meas. Tech.
ChEMBL_807028 (CHEMBL1959420)
IC50
>20000000±n/a nM
Citation
 Burgess, AWigan, MGiles, NDepinto, WGillespie, PStevens, FGabrielli, B Inhibition of S/G2 phase CDK4 reduces mitotic fidelity. J Biol Chem 281:9987-95 (2006)  
Target
Name:
Hepatocyte growth factor receptor
Synonyms:
Hepatocyte growth factor receptor Hepatocyte growth factor receptor (c-MET) MET Met proto-oncogene (hepatocyte growth factor receptor) Tyrosine-protein kinase Met (c-Met) c-Met kinase
Type:
Protein
Mol. Mass.:
155559.73
Organism:
Homo sapiens (Human)
Description:
P08581
Residue:
1390
  
Inhibitor
Name:
BDBM50365217
Synonyms:
CHEMBL1956069
Type:
Small organic molecule
Emp. Form.:
C24H29N5O2S
Mol. Mass.:
451.584
SMILES:
COc1cccc(c1)C(=O)c1sc(Nc2ccc(cc2)N2CCN(CC2)C(C)C)nc1N
: