Target
Dihydroorotate dehydrogenase (quinone), mitochondrial
Ligand
BDBM50365241
Substrate
Meas. Tech.
ChEMBL_808186 (CHEMBL1961098)
IC50
>100000±n/a nM
Citation
 Coteron, JMMarco, MEsquivias, JDeng, XWhite, KLWhite, JKoltun, MEl Mazouni, FKokkonda, SKatneni, KBhamidipati, RShackleford, DMAngulo-Barturen, IFerrer, SBJiménez-Díaz, MBGamo, FJGoldsmith, EJCharman, WNBathurst, IFloyd, DMatthews, DBurrows, JNRathod, PKCharman, SAPhillips, MA Structure-guided lead optimization of triazolopyrimidine-ring substituents identifies potent Plasmodium falciparum dihydroorotate dehydrogenase inhibitors with clinical candidate potential. J Med Chem 54:5540-61 (2011)  
Target
Name:
Dihydroorotate dehydrogenase (quinone), mitochondrial
Synonyms:
DHODH Dihydroorotate dehydrogenase Dihydroorotate dehydrogenase, mitochondrial Dihydroorotate oxidase (DHODH) | PYRD_HUMAN
Type:
Enzyme
Mol. Mass.:
42881.33
Organism:
Homo sapiens (Human)
Description:
Q02127
Residue:
395
  
Inhibitor
Name:
BDBM50365241
Synonyms:
CHEMBL1956269 | US9238653, Table 5, Compound 51
Type:
Small organic molecule
Emp. Form.:
C15H16F5N5S
Mol. Mass.:
393.378
SMILES:
CC(C)c1nc2nc(C)cc(Nc3ccc(cc3)S(F)(F)(F)(F)F)n2n1
: