Target
Growth hormone secretagogue receptor type 1
Ligand
BDBM50365813
Substrate
Meas. Tech.
ChEMBL_806242 (CHEMBL1958783)
Ki
0.900000±n/a nM
Citation
 Hanrahan, PBell, JBottomley, GBradley, SClarke, PCurtis, EDavis, SDawson, GHorswill, JKeily, JMoore, GRasamison, CBloxham, J Substituted azaquinazolinones as modulators of GHSr-1a for the treatment of type II diabetes and obesity. Bioorg Med Chem Lett 22:2271-8 (2012)  
Target
Name:
Growth hormone secretagogue receptor type 1
Synonyms:
GH-releasing peptide receptor GHS-R GHSR_HUMAN Ghrelin receptor | Ghrelin receptor 1a (GHS-R1a)
Type:
Receptor
Mol. Mass.:
41334.57
Organism:
Homo sapiens (Human)
Description:
Receptor binding studies use plasma membranes from LLC PK-1 cells transiently transfected with hGHSR1a.
Residue:
366
  
Inhibitor
Name:
BDBM50365813
Synonyms:
CHEMBL1956992
Type:
Small organic molecule
Emp. Form.:
C24H28N4O4
Mol. Mass.:
436.5035
SMILES:
CC(C)N1CCC[C@H](Cn2c(C)nc3ccc(Oc4ccc5OCOc5c4)nc3c2=O)C1
: