Target
Prostaglandin E2 receptor EP2 subtype
Ligand
BDBM50366136
Substrate
Meas. Tech.
ChEMBL_808314 (CHEMBL1961331)
Ki
3±n/a nM
Citation
 Kambe, TMaruyama, TNakai, YYoshida, HOida, HMaruyama, TAbe, NNishiura, ANakai, HToda, M Discovery of novel prostaglandin analogs as potent and selective EP2/EP4 dual agonists. Bioorg Med Chem 20:2235-51 (2012)  
Target
Name:
Prostaglandin E2 receptor EP2 subtype
Synonyms:
PE2R2_MOUSE Prostaglandin E2 Prostanoid EP2 receptor Ptgerep2
Type:
G-protein coupled receptor
Mol. Mass.:
40495.26
Organism:
Mus musculus (Mouse)
Description:
Residue:
362
  
Inhibitor
Name:
BDBM50366136
Synonyms:
CHEMBL1957435
Type:
Small organic molecule
Emp. Form.:
C26H26N2O4S2
Mol. Mass.:
494.626
SMILES:
O[C@@H](Cc1cccc(c1)-c1ccccc1)\C=C\[C@H]1CCC(=O)N1CCSc1nc(cs1)C(O)=O
: