Target
Platelet-activating factor receptor
Ligand
BDBM50280339
Substrate
Meas. Tech.
ChEMBL_155140 (CHEMBL759830)
Ki
1±n/a nM
Citation
 Bugianesi, RLPonpipom, MMParsons, WHHwang, SDoebber, TWLam, MWu, MSAlberts, AWChabala, JC Synthesis and biological activity of the platelet-activating factor antagonist ()-trans-2-(3-methoxy-4-phenylsulfonylethoxy-5-n-propylsulfonylphenyl)-5-(3,4,5-trimethoxyphenyl)tetrahydrofuran (L-671,284) and its analogs Bioorg Med Chem Lett 2:181-184 (1992)    Article 
Target
Name:
Platelet-activating factor receptor
Synonyms:
PAF Platelet activating factor PAFR PTAFR_HUMAN Platelet-activating factor receptor
Type:
Enzyme Catalytic Domain
Mol. Mass.:
39219.60
Organism:
Homo sapiens (Human)
Description:
PAF Platelet activating factor PTAFR HUMAN::P25105
Residue:
342
  
Inhibitor
Name:
BDBM50280339
Synonyms:
(S)-2-[4-(2-Benzenesulfonyl-ethoxy)-3-methoxy-5-(propane-1-sulfonyl)-phenyl]-5-(3,4,5-trimethoxy-phenyl)-tetrahydro-furan L-671284
Type:
Small organic molecule
Emp. Form.:
C31H38O10S2
Mol. Mass.:
634.757
SMILES:
CCCS(=O)(=O)c1cc(cc(OC)c1OCCS(=O)(=O)c1ccccc1)C1CC[C@H](O1)c1cc(OC)c(OC)c(OC)c1
: