Target
Type-2 angiotensin II receptor
Ligand
BDBM50282705
Substrate
Meas. Tech.
ChEMBL_35436 (CHEMBL643796)
IC50
0.35±n/a nM
Citation
 Glinka, TWde Laszlo, SETran, JChang, RSChen, TLotti, VJGreenlee, WJ L-161,638: A potent AT2selective quinazolinone angiotensin II binding inhibitor Bioorg Med Chem Lett 4:1479-1484 (1994)    Article 
Target
Name:
Type-2 angiotensin II receptor
Synonyms:
AGTR2_RAT Agtr2 Angiotensin II receptor Type-2 angiotensin II receptor
Type:
Enzyme Catalytic Domain
Mol. Mass.:
41346.62
Organism:
RAT
Description:
Angiotensin II AT2 0 0::P35351
Residue:
363
  
Inhibitor
Name:
BDBM50282705
Synonyms:
CHEMBL290669 | N-Benzyl-N-{2-isopropyl-4-oxo-3-[2'-(1H-tetrazol-5-yl)-biphenyl-4-ylmethyl]-3,4-dihydro-quinazolin-6-yl}-benzamide
Type:
Small organic molecule
Emp. Form.:
C39H33N7O2
Mol. Mass.:
631.725
SMILES:
CC(C)c1nc2ccc(cc2c(=O)n1Cc1ccc(cc1)-c1ccccc1-c1nnn[nH]1)N(Cc1ccccc1)C(=O)c1ccccc1
: