Target
Neurotensin receptor type 1
Ligand
BDBM50286859
Substrate
Meas. Tech.
ChEBML_144282
Ki
0.060000±n/a nM
Citation
 Wustrow, DDavis, MAkunne, HCorbin, AWiley, JWise, LHeffner, T Reduced amide bond neurotensin 813 mimetics with potent in vivo activity Bioorg Med Chem Lett 5:997-1002 (1995)    Article 
Target
Name:
Neurotensin receptor type 1
Synonyms:
NT-R-1 Neurotensin 1 Neurotensin receptor type 1 Ntsr1
Type:
Enzyme Catalytic Domain
Mol. Mass.:
47237.04
Organism:
MOUSE
Description:
Neurotensin 1 NTSR1 MOUSE::A2ACT4
Residue:
424
  
Inhibitor
Name:
BDBM50286859
Synonyms:
2-{2-[(S)-2-({1-[(S)-6-Amino-2-((S)-(S)-2,6-diamino-hexylamino)-hexanoyl]-pyrrolidine-2-carbonyl}-amino)-3-(1H-indol-3-yl)-1-(S)-oxo-propylamino]-3-methyl-pentanoylamino}-4-methyl-pentanoic acid | CHEMBL427604
Type:
Small organic molecule
Emp. Form.:
C40H67N9O6
Mol. Mass.:
770.0167
SMILES:
CC[C@H](C)[C@H](NC(=O)[C@H](Cc1c[nH]c2ccccc12)NC(=O)[C@H]1CCCN1C(=O)[C@H](CCCCN)NC[C@@H](N)CCCCN)C(=O)N[C@@H](CC(C)C)C(O)=O
: