Target
Endothelin receptor type B
Ligand
BDBM50287878
Substrate
Meas. Tech.
ChEMBL_63860 (CHEMBL672904)
Ki
5±n/a nM
Citation
 Fruh, TSaika, HSvensson, LPitterna, TSakaki, JOkada, TUrade, YOda, KFujitani, YTakimoto, MYamamura, TInui, TMakatani, MUmemura, ITeno, NToh, HHayakawa, KMurata, T IRL 2500: A potent ETB selective endothelin antagonist Bioorg Med Chem Lett 6:2323-2328 (1996)    Article 
Target
Name:
Endothelin receptor type B
Synonyms:
EDNRB Endothelin receptor ET-B
Type:
PROTEIN
Mol. Mass.:
49616.89
Organism:
Sus scrofa
Description:
ChEMBL_63872
Residue:
443
  
Inhibitor
Name:
BDBM50287878
Synonyms:
CGP-49941 N-{(R)-1-[2-(1H-Indol-3-yl)-ethylcarbamoyl]-2-phenyl-ethyl}-3,5,N-trimethyl-benzamide
Type:
Small organic molecule
Emp. Form.:
C29H31N3O2
Mol. Mass.:
453.5753
SMILES:
CN([C@H](Cc1ccccc1)C(=O)NCCc1c[nH]c2ccccc12)C(=O)c1cc(C)cc(C)c1
: