Target
Gastrin-releasing peptide receptor
Ligand
BDBM50288237
Substrate
Meas. Tech.
ChEBML_71531
Ki
>10000±n/a nM
Citation
 Eden, JHall, MHigginbottom, MHorwell, DHowson, WHughes, JJordan, RLewthwaite, RMartin, KMcKnight, APinnock, RPritchard, MSuman-Chauhan, NWilliams, S PD 165929 the first high affinity non-peptide neuromedin-B (NMB) receptor selective antagonist Bioorg Med Chem Lett 6:2617-2622 (1996)    Article 
Target
Name:
Gastrin-releasing peptide receptor
Synonyms:
Bombesin 2 GRP-preferring bombesin receptor GRPR_HUMAN Gastrin-releasing peptide receptor
Type:
Enzyme Catalytic Domain
Mol. Mass.:
43214.53
Organism:
Homo sapiens (Human)
Description:
Bombesin 2 GRPR 0::P30550
Residue:
384
  
Inhibitor
Name:
BDBM50288237
Synonyms:
CHEMBL88174 | N-Cyclohexylmethyl-2-[3-(2,6-diisopropyl-phenyl)-3-methyl-ureido]-3-(1H-indol-3-yl)-propionamide
Type:
Small organic molecule
Emp. Form.:
C32H44N4O2
Mol. Mass.:
516.7174
SMILES:
CC(C)c1cccc(C(C)C)c1N(C)C(=O)NC(Cc1c[nH]c2ccccc12)C(=O)NCC1CCCCC1
: