Target
Prothrombin
Ligand
BDBM50450514
Substrate
Meas. Tech.
ChEBML_207962
IC50
3900±n/a nM
Citation
 Salimbeni, APaleari, FCanevotti, RCriscuoli, MCriscuoli, MLippi, AAngiolini, MBelvisi, LScolastico, CColombo, L Design and synthesis of conformationally constrained arginal thrombin inhibitors Bioorg Med Chem Lett 7:2205-2210 (1997)    Article 
Target
Name:
Prothrombin
Synonyms:
Activation peptide fragment 1 Coagulation factor II Prothrombin precursor Thrombin heavy chain | Thrombin light chain
Type:
Protein
Mol. Mass.:
70029.57
Organism:
Homo sapiens (Human)
Description:
P00734
Residue:
622
  
Inhibitor
Name:
BDBM50450514
Synonyms:
CHEMBL2304270
Type:
Small organic molecule
Emp. Form.:
C24H35ClN6O4
Mol. Mass.:
507.026
SMILES:
Cl.[H][C@]12CC[C@H](N1C(=O)[C@](Cc1ccccc1)(CC2)NC(C)=O)C(=O)N[C@H]1CCCN(C1O)C(N)=N
: