Target
Endothelin-1 receptor
Ligand
BDBM50290052
Substrate
Meas. Tech.
ChEBML_65500
IC50
1100±n/a nM
Citation
 Neidhart, WBreu, VBurri, KClozel, MHirth, GKlinkhammer, UGiller, TRamuz, H Discovery of Ro 48-5695: A potent mixed endothelin receptor antagonist optimized from bosentan Bioorg Med Chem Lett 7:2223-2228 (1997)    Article 
Target
Name:
Endothelin-1 receptor
Synonyms:
EDNRA ET-A ETA-R Endothelin receptor type A hET-AR
Type:
Enzyme Catalytic Domain
Mol. Mass.:
48736.88
Organism:
Homo sapiens (Human)
Description:
P25101
Residue:
427
  
Inhibitor
Name:
BDBM50290052
Synonyms:
CHEMBL74118 | Furan-3-carboxylic acid 2-[6-(4-tert-butyl-benzenesulfonylamino)-5-(2-methoxy-phenoxy)-2-methyl-pyrimidin-4-yloxy]-ethyl ester
Type:
Small organic molecule
Emp. Form.:
C29H31N3O8S
Mol. Mass.:
581.637
SMILES:
COc1ccccc1Oc1c(NS(=O)(=O)c2ccc(cc2)C(C)(C)C)nc(C)nc1OCCOC(=O)c1ccoc1
: