Target
Endothelin receptor type B
Ligand
BDBM50290060
Substrate
Meas. Tech.
ChEBML_63703
IC50
49±n/a nM
Citation
 Neidhart, WBreu, VBurri, KClozel, MHirth, GKlinkhammer, UGiller, TRamuz, H Discovery of Ro 48-5695: A potent mixed endothelin receptor antagonist optimized from bosentan Bioorg Med Chem Lett 7:2223-2228 (1997)    Article 
Target
Name:
Endothelin receptor type B
Synonyms:
EDNRB ENDOTHELIN B ETRB Endothelin receptor non-selective type | Endothelin receptor, ET-A/ET-B
Type:
Enzyme Catalytic Domain
Mol. Mass.:
49664.00
Organism:
Homo sapiens (Human)
Description:
ENDOTHELIN B EDNRB HUMAN::P24530
Residue:
442
  
Inhibitor
Name:
BDBM50290060
Synonyms:
CHEMBL70293 | Pyridin-2-yl-carbamic acid 2-[6-(5-isopropyl-pyridine-2-sulfonylamino)-5-(2-methoxy-phenoxy)-[2,2']bipyrimidinyl-4-yloxy]-ethyl ester
Type:
Small organic molecule
Emp. Form.:
C31H30N8O7S
Mol. Mass.:
658.684
SMILES:
COc1ccccc1Oc1c(NS(=O)(=O)c2ccc(cn2)C(C)C)nc(nc1OCCOC(=O)Nc1ccccn1)-c1ncccn1
: