Target
D(3) dopamine receptor
Ligand
BDBM50063291
Substrate
Meas. Tech.
ChEMBL_58772 (CHEMBL669160)
Ki
0.800000±n/a nM
Citation
 Belliotti, TRKesten, SRRubin, JRWustrow, DJGeorgic, LMZoski, KTAkunne, HCWise, LD Novel cyclohexyl amides as potent and selective D3 dopamine receptor ligands Bioorg Med Chem Lett 7:2403-2408 (1997)    Article 
Target
Name:
D(3) dopamine receptor
Synonyms:
DOPAMINE D3 DRD3_HUMAN Dopamine D3 receptor (D3) Dopamine receptor Dopamine receptor D3
Type:
Mol. Mass.:
44243.43
Organism:
Homo sapiens (Human)
Description:
Residue:
400
  
Inhibitor
Name:
BDBM50063291
Synonyms:
CHEMBL78791 | Thiophene-2-carboxylic acid {4-[2-(4-phenyl-piperazin-1-yl)-ethyl]-cyclohexyl}-amide
Type:
Small organic molecule
Emp. Form.:
C23H31N3OS
Mol. Mass.:
397.577
SMILES:
O=C(N[C@H]1CC[C@H](CCN2CCN(CC2)c2ccccc2)CC1)c1cccs1
: