Target
D(3) dopamine receptor
Ligand
BDBM50290217
Substrate
Meas. Tech.
ChEBML_58772
Ki
2.5±n/a nM
Citation
 Belliotti, TRKesten, SRRubin, JRWustrow, DJGeorgic, LMZoski, KTAkunne, HCWise, LD Novel cyclohexyl amides as potent and selective D3 dopamine receptor ligands Bioorg Med Chem Lett 7:2403-2408 (1997)    Article 
Target
Name:
D(3) dopamine receptor
Synonyms:
DOPAMINE D3 DRD3_HUMAN Dopamine D3 receptor (D3) Dopamine receptor Dopamine receptor D3
Type:
Mol. Mass.:
44243.43
Organism:
Homo sapiens (Human)
Description:
Residue:
400
  
Inhibitor
Name:
BDBM50290217
Synonyms:
CHEMBL78916 | N-{4-[2-(4-Phenyl-piperazin-1-yl)-ethyl]-cyclohexyl}-acetamide
Type:
Small organic molecule
Emp. Form.:
C20H31N3O
Mol. Mass.:
329.4796
SMILES:
CC(=O)N[C@H]1CC[C@H](CCN2CCN(CC2)c2ccccc2)CC1
: