Target
D(3) dopamine receptor
Ligand
BDBM50290209
Substrate
Meas. Tech.
ChEBML_58772
Ki
1.4±n/a nM
Citation
 Belliotti, TRKesten, SRRubin, JRWustrow, DJGeorgic, LMZoski, KTAkunne, HCWise, LD Novel cyclohexyl amides as potent and selective D3 dopamine receptor ligands Bioorg Med Chem Lett 7:2403-2408 (1997)    Article 
Target
Name:
D(3) dopamine receptor
Synonyms:
DOPAMINE D3 DRD3_HUMAN Dopamine D3 receptor (D3) Dopamine receptor Dopamine receptor D3
Type:
Mol. Mass.:
44243.43
Organism:
Homo sapiens (Human)
Description:
Residue:
400
  
Inhibitor
Name:
BDBM50290209
Synonyms:
CHEMBL310577 | Thiophene-2-carboxylic acid (4-{2-[4-(3-methoxy-phenyl)-piperazin-1-yl]-ethyl}-cyclohexyl)-amide
Type:
Small organic molecule
Emp. Form.:
C24H33N3O2S
Mol. Mass.:
427.603
SMILES:
COc1cccc(c1)N1CCN(CC[C@H]2CC[C@@H](CC2)NC(=O)c2cccs2)CC1
: