Target
Delta-type opioid receptor
Ligand
BDBM50290388
Substrate
Meas. Tech.
ChEBML_146485
Ki
11±n/a nM
Citation
 Schmidhammer, HDaurer, DWieser, MMonory, KBorsodi, AElliott, JTraynor, JR Synthesis and biological evaluation of 14-alkoxymorphinans. 14.1 14-ethoxy-5-methyl substituted indolomorphinans with opioid receptor selectivity Bioorg Med Chem Lett 7:151-156 (1997)    Article 
Target
Name:
Delta-type opioid receptor
Synonyms:
Cytochrome P450 3A4 Delta opioid receptor Delta-type opioid receptor (DOR) OPRD_RAT Opioid receptor Opioid receptors; mu & delta Ror-a | Voltage-gated potassium channel
Type:
G Protein-Coupled Receptor (GPCR)
Mol. Mass.:
40465.04
Organism:
Rattus norvegicus (rat)
Description:
Competition binding assays were using CHO-K1 cell membranes expressing the opioid receptor.
Residue:
372
  
Inhibitor
Name:
BDBM50290388
Synonyms:
22-allyl-2-ethoxy-13-methyl-14-oxa-11,22-diazaheptacyclo[13.9.1.01,13.02,21.04,12.05,10.019,25]pentacosa-4(12),5(10),6,8,15,17,19(25)-heptaen-16-ol
Type:
Small organic molecule
Emp. Form.:
C28H30N2O3
Mol. Mass.:
442.5494
SMILES:
CCO[C@]12Cc3c([nH]c4ccccc34)[C@]3(C)Oc4c5c(CC1N(CC=C)CC[C@@]235)ccc4O
: