Target
Neprilysin
Ligand
BDBM50291558
Substrate
Meas. Tech.
ChEBML_144318
IC50
0.740000±n/a nM
Citation
 De Lombaert, SStamford, LBBlanchard, LTan, JHoyer, DDiefenbacher, CGWei, DWallace, EMMoskal, MASavage, PJeng, AY Potent non-peptidic dual inhibitors of endothelin-converting enzyme and neutral endopeptidase 24.11 Bioorg Med Chem Lett 7:1059-1064 (1997)    Article 
Target
Name:
Neprilysin
Synonyms:
Atriopeptidase CD_antigen=CD10 EPN MME NEP_HUMAN Neutral endopeptidase | Neutral endopeptidase 24.11
Type:
Enzyme
Mol. Mass.:
85505.38
Organism:
Homo sapiens (Human)
Description:
P08473
Residue:
750
  
Inhibitor
Name:
BDBM50291558
Synonyms:
CHEMBL276872 | {1-[(S)-2-Biphenyl-4-yl-1-(1H-tetrazol-5-yl)-ethylamino]-2-phenyl-ethyl}-phosphonic acid
Type:
Small organic molecule
Emp. Form.:
C23H24N5O3P
Mol. Mass.:
449.4421
SMILES:
OP(O)(=O)C(Cc1ccccc1)N[C@@H](Cc1ccc(cc1)-c1ccccc1)c1nnn[nH]1
: