Target
Neuromedin-B receptor
Ligand
BDBM50071739
Substrate
Meas. Tech.
ChEMBL_39622 (CHEMBL649929)
IC50
0.660000±n/a nM
Citation
 Ashwood, VBrownhill, VHigginbottom, MHorwell, DCHughes, JLewthwaite, RAMcKnight, ATPinnock, RDPritchard, MCSuman-Chauhan, NWebb, CWilliams, SC PD 176252--the first high affinity non-peptide gastrin-releasing peptide (BB2) receptor antagonist. Bioorg Med Chem Lett 8:2589-94 (1999)  
Target
Name:
Neuromedin-B receptor
Synonyms:
Bombesin 1 NMBR Neuromedin B Neuromedin-B receptor | Neuromedin-B-preferring bombesin receptor
Type:
Enzyme Catalytic Domain
Mol. Mass.:
43447.11
Organism:
Homo sapiens (Human)
Description:
Bombesin 1 NMBR 0::P28336
Residue:
390
  
Inhibitor
Name:
BDBM50071739
Synonyms:
(S)-3-(1H-Indol-3-yl)-N-[1-(5-methoxy-pyridin-2-yl)-cyclohexylmethyl]-2-methyl-2-[3-(4-nitro-phenyl)-ureido]-propionamide | CHEMBL405908
Type:
Small organic molecule
Emp. Form.:
C32H36N6O5
Mol. Mass.:
584.6654
SMILES:
COc1ccc(nc1)C1(CNC(=O)[C@](C)(Cc2c[nH]c3ccccc23)NC(=O)Nc2ccc(cc2)[N+]([O-])=O)CCCCC1
: