Target
Androgen receptor
Ligand
BDBM50067678
Substrate
Meas. Tech.
ChEBML_36274
Ki
2.9±n/a nM
Citation
 Zhi, LTegley, CMEdwards, JPWest, SJMarschke, KBGottardis, MMMais, DEJones, TK 5-Alkyl 1,2-dihydrochromeno[3,4-f]quinolines: a novel class of nonsteroidal progesterone receptor modulators. Bioorg Med Chem Lett 8:3365-70 (1999)  
Target
Name:
Androgen receptor
Synonyms:
ANDR_HUMAN Androgen Receptor Androgen receptor/Baculoviral IAP repeat-containing protein 2 Dihydrotestosterone receptor Nuclear receptor subfamily 3 group C member 4
Type:
Receptor
Mol. Mass.:
99185.27
Organism:
Homo sapiens (Human)
Description:
CHO cells were stably transfected with human AR gene.
Residue:
920
  
Inhibitor
Name:
BDBM50067678
Synonyms:
(6alpha)-17-(Acetyloxy)-6-methylpreg-4-ene-3,20-dione 17-Acetoxy-6alpha-methylprogesterone 6-alpha-Methyl-17-alpha-acetoxyprogesterone 6alpha-Methyl-17-acetoxy progesterone 6alpha-Methyl-4-pregnene-3,20-dion-17alpha-ol acetate Medroxyacetate progesterone Methylacetoxyprogesterone US9271961, MPA | medroxyprogesterone acetate
Type:
Small organic molecule
Emp. Form.:
C24H34O4
Mol. Mass.:
386.5244
SMILES:
C[C@H]1C[C@H]2[C@@H]3CC[C@](OC(C)=O)(C(C)=O)[C@@]3(C)CC[C@@H]2[C@@]2(C)CCC(=O)C=C12
: