Target
Sodium-dependent serotonin transporter
Ligand
BDBM50025691
Substrate
Meas. Tech.
ChEBML_184250
Ki
16500±n/a nM
Citation
 Carlier, PRLo, MMLo, PCRichelson, ETatsumi, MReynolds, IJSharma, TA Synthesis of a potent wide-spectrum serotonin-, norepinephrine-, dopamine-reuptake inhibitor (SNDRI) and a species-selective dopamine-reuptake inhibitor based on the gamma-amino alcohol functional group. Bioorg Med Chem Lett 8:487-92 (1999)  
Target
Name:
Sodium-dependent serotonin transporter
Synonyms:
5-HT Transporter 5HT transporter Anandamid membrane transporter, AMT Monoamine transporters; Norepinephrine & serotonin Slc6a4 Sodium-dependent serotonin transporter (SERT) | imipramine receptor
Type:
Multi-pass membrane protein
Mol. Mass.:
70168.43
Organism:
Rattus norvegicus (rat)
Description:
P31652
Residue:
630
  
Inhibitor
Name:
BDBM50025691
Synonyms:
2-(2-Ethoxy-phenoxymethyl)-morpholine 2-(2-Ethoxy-phenoxymethyl)-morpholine(viloxazine) VILOXAZINE
Type:
Small organic molecule
Emp. Form.:
C13H19NO3
Mol. Mass.:
237.2949
SMILES:
CCOc1ccccc1OCC1CNCCO1
: