Target
Prostaglandin G/H synthase 1
Ligand
BDBM13066
Substrate
Meas. Tech.
ChEBML_158735
IC50
150±n/a nM
Citation
 Prasit, PWang, ZBrideau, CChan, CCCharleson, SCromlish, WEthier, DEvans, JFFord-Hutchinson, AWGauthier, JYGordon, RGuay, JGresser, MKargman, SKennedy, BLeblanc, YLéger, SMancini, JO'Neill, GPOuellet, MPercival, MDPerrier, HRiendeau, DRodger, IZamboni, R The discovery of rofecoxib, [MK 966, Vioxx, 4-(4'-methylsulfonylphenyl)-3-phenyl-2(5H)-furanone], an orally active cyclooxygenase-2-inhibitor. Bioorg Med Chem Lett 9:1773-8 (1999)  
Target
Name:
Prostaglandin G/H synthase 1
Synonyms:
COX-1 Cyclooxygenase Cyclooxygenase-1 (COX-1) PTGS1 | Prostaglandin G/H synthase (cyclooxygenase)
Type:
Enzyme
Mol. Mass.:
68692.62
Organism:
Homo sapiens (Human)
Description:
P23219
Residue:
599
  
Inhibitor
Name:
BDBM13066
Synonyms:
2-{2-[(2,6-dichlorophenyl)amino]phenyl}acetic acid Diclofenac US11478464, Compound Diclofenac {2-[(2,6-dichlorophenyl)amino]phenyl}acetic acid
Type:
Small organic molecule
Emp. Form.:
C14H11Cl2NO2
Mol. Mass.:
296.149
SMILES:
OC(=O)Cc1ccccc1Nc1c(Cl)cccc1Cl
: