Target
Sodium-dependent dopamine transporter
Ligand
BDBM50078778
Substrate
Meas. Tech.
ChEMBL_62480 (CHEMBL677372)
Ki
34000±n/a nM
Citation
 Kozikowski, APSimoni, DRoberti, MRondanin, RWang, SDu, PJohnson, KM Synthesis of 8-Oxa analogues of norcocaine endowed with interesting cocaine-like activity. Bioorg Med Chem Lett 9:1831-6 (1999)  
Target
Name:
Sodium-dependent dopamine transporter
Synonyms:
DA transporter SC6A3_RAT Sodium-dependent dopamine transporter | Sodium-dependent dopamine transporter (DAT)
Type:
Multi-pass membrane protein
Mol. Mass.:
68749.45
Organism:
Rattus norvegicus (rat)
Description:
P23977
Residue:
619
  
Inhibitor
Name:
BDBM50078778
Synonyms:
(2R,3R)-3-Benzoyloxy-8-oxa-bicyclo[3.2.1]octane-2-carboxylic acid methyl ester | CHEMBL299297
Type:
Small organic molecule
Emp. Form.:
C16H18O5
Mol. Mass.:
290.3111
SMILES:
COC(=O)[C@@H]1C2CCC(C[C@H]1OC(=O)c1ccccc1)O2
: