Target
Interstitial collagenase
Ligand
BDBM50076993
Substrate
Meas. Tech.
ChEMBL_101758 (CHEMBL709114)
Ki
<1±n/a nM
Citation
 Cherney, RJWang, LMeyer, DTXue, CBArner, ECCopeland, RACovington, MBHardman, KDWasserman, ZRJaffee, BDDecicco, CP Macrocyclic hydroxamate inhibitors of matrix metalloproteinases and TNF-alpha production. Bioorg Med Chem Lett 9:1279-84 (1999)  
Target
Name:
Interstitial collagenase
Synonyms:
CLG MMP1 Matrix metalloproteinase-1 | Matrix metalloproteinase-1 (MMP-1)
Type:
Enzyme
Mol. Mass.:
54010.26
Organism:
Homo sapiens (Human)
Description:
P03956
Residue:
469
  
Inhibitor
Name:
BDBM50076993
Synonyms:
(2S,11S,12R)-12-Isobutyl-13-oxo-1,7diaza-cyclotridecane-2,11-dicarboxylic acid 11-hydroxyamide 2-methylamide; hydrochloride CHEMBL88220
Type:
Small organic molecule
Emp. Form.:
C18H34N4O4
Mol. Mass.:
370.487
SMILES:
CNC(=O)[C@@H]1CCCCNCCC[C@@H]([C@@H](CC(C)C)C(=O)N1)C(=O)NO
: