Target
Transporter
Ligand
BDBM22418
Substrate
Meas. Tech.
ChEMBL_143128 (CHEMBL744172)
Ki
186±n/a nM
Citation
 Tamiz, APSmith, MPEnyedy, IFlippen-Anderson, JZhang, MJohnson, KMKozikowski, AP Synthesis and biological evaluation of 1-azabicyclo-[3.2.1]octanes: new dopamine transporter inhibitors. Bioorg Med Chem Lett 10:1681-6 (2000)  
Target
Name:
Transporter
Synonyms:
Monoamine transporters; Norepininephrine & dopamine | Norepinephrine Monoamine transporters
Type:
PROTEIN
Mol. Mass.:
66787.87
Organism:
Rattus norvegicus
Description:
ChEMBL_1463061
Residue:
597
  
Inhibitor
Name:
BDBM22418
Synonyms:
Cocaine methyl (1R,2R,3S,5S)-3-(benzoyloxy)-8-methyl-8-azabicyclo[3.2.1]octane-2-carboxylate | methyl (1R,2R,3S,5S)-8-methyl-3-[(phenylcarbonyl)oxy]-8-azabicyclo[3.2.1]octane-2-carboxylate
Type:
Emp. Form.:
C17H21NO4
Mol. Mass.:
303.3529
SMILES:
[H][C@]12CC[C@]([H])([C@H]([C@H](C1)OC(=O)c1ccccc1)C(=O)OC)N2C
: