Target
Adenosine receptor A2a
Ligand
BDBM50085662
Substrate
Meas. Tech.
ChEBML_31973
Ki
0.160000±n/a nM
Citation
 Keeling, SEAlbinson, FDAyres, BEButchers, PRChambers, CLCherry, PCEllis, FEwan, GBGregson, MKnight, JMills, KRavenscroft, PReynolds, LHSanjar, SSheehan, MJ The discovery and synthesis of highly potent, A2a receptor agonists. Bioorg Med Chem Lett 10:403-6 (2000)  
Target
Name:
Adenosine receptor A2a
Synonyms:
A2A adenosine receptor (hA2A) ADENOSINE A2 ADORA2 Adenosine A2A receptor (A2AAR)
Type:
G Protein-Coupled Receptor (GPCR)
Mol. Mass.:
44716.46
Organism:
Homo sapiens (Human)
Description:
P29274
Residue:
412
  
Inhibitor
Name:
BDBM50085662
Synonyms:
(2S,3S,4R,5R)-5-[6-(2,2-Diphenyl-ethylamino)-2-((1R,2R)-2-hydroxy-cyclopentylamino)-purin-9-yl]-3,4-dihydroxy-tetrahydro-furan-2-carboxylic acid ethylamide | CHEMBL131457
Type:
Small organic molecule
Emp. Form.:
C31H37N7O5
Mol. Mass.:
587.6694
SMILES:
CCNC(=O)[C@H]1O[C@H]([C@H](O)[C@@H]1O)n1cnc2c(NCC(c3ccccc3)c3ccccc3)nc(N[C@@H]3CCC[C@H]3O)nc12
: