Target
Mu-type opioid receptor
Ligand
BDBM50001023
Substrate
Meas. Tech.
ChEMBL_145277 (CHEMBL751213)
Ki
0.320000±n/a nM
Citation
 Wentland, MPLou, RDehnhardt, CMDuan, WCohen, DJBidlack, JM 3-Carboxamido analogues of morphine and naltrexone. synthesis and opioid receptor binding properties. Bioorg Med Chem Lett 11:1717-21 (2001)  
Target
Name:
Mu-type opioid receptor
Synonyms:
M-OR-1 Mu opioid receptor OPIATE Mu OPRM_CAVPO
Type:
Enzyme Catalytic Domain
Mol. Mass.:
11165.58
Organism:
GUINEA PIG
Description:
P97266
Residue:
98
  
Inhibitor
Name:
BDBM50001023
Synonyms:
(2R,6R,11R)-3-Cyclopropylmethyl-6,11-dimethyl-1,2,3,4,5,6-hexahydro-2,6-methano-benzo[d]azocin-8-ol CHEMBL56585 US10231963, Table B.9 US11534436, Compound Table B.9 | US9656961, Example 00126
Type:
Small organic molecule
Emp. Form.:
C18H25NO
Mol. Mass.:
271.3972
SMILES:
C[C@H]1[C@H]2Cc3ccc(O)cc3[C@]1(C)CCN2CC1CC1
: