Target
Carbonic anhydrase 2
Ligand
BDBM50101369
Substrate
Meas. Tech.
ChEBML_45058
Ki
36±n/a nM
Citation
 Mincione, FStarnotti, MMenabuoni, LScozzafava, ACasini, ASupuran, CT Carbonic anhydrase inhibitors: 4-sulfamoyl-benzenecarboxamides and 4-chloro-3-sulfamoyl-benzenecarboxamides with strong topical antiglaucoma properties. Bioorg Med Chem Lett 11:1787-91 (2001)  
Target
Name:
Carbonic anhydrase 2
Synonyms:
CA-II CAC Carbonate dehydratase II Carbonic anhydrase 2 (CA-II) Carbonic anhydrase C Carbonic anhydrase II (CA-II) Carbonic anhydrase II (hCA II) | Carbonic anhydrase isoenzyme II (hCA II)
Type:
Enzyme
Mol. Mass.:
29250.71
Organism:
Homo sapiens (Human)
Description:
P00918
Residue:
260
  
Inhibitor
Name:
BDBM50101369
Synonyms:
(S)-2-[3-(4-Chloro-3-sulfamoyl-benzoylamino)-propionylamino]-3-(3H-imidazol-4-yl)-propionic acid | CHEMBL300020
Type:
Small organic molecule
Emp. Form.:
C16H18ClN5O6S
Mol. Mass.:
443.862
SMILES:
NS(=O)(=O)c1cc(ccc1Cl)C(=O)NCCC(=O)N[C@@H](Cc1cnc[nH]1)C(O)=O
: