Target
Carbonic anhydrase 2
Ligand
BDBM50101388
Substrate
Meas. Tech.
ChEBML_45058
Ki
26±n/a nM
Citation
 Mincione, FStarnotti, MMenabuoni, LScozzafava, ACasini, ASupuran, CT Carbonic anhydrase inhibitors: 4-sulfamoyl-benzenecarboxamides and 4-chloro-3-sulfamoyl-benzenecarboxamides with strong topical antiglaucoma properties. Bioorg Med Chem Lett 11:1787-91 (2001)  
Target
Name:
Carbonic anhydrase 2
Synonyms:
CA-II CAC Carbonate dehydratase II Carbonic anhydrase 2 (CA-II) Carbonic anhydrase C Carbonic anhydrase II (CA-II) Carbonic anhydrase II (hCA II) | Carbonic anhydrase isoenzyme II (hCA II)
Type:
Enzyme
Mol. Mass.:
29250.71
Organism:
Homo sapiens (Human)
Description:
P00918
Residue:
260
  
Inhibitor
Name:
BDBM50101388
Synonyms:
4-Chloro-3-sulfamoyl-N-[2-(4-sulfamoyl-phenyl)-ethyl]-benzamide | CHEMBL53607
Type:
Small organic molecule
Emp. Form.:
C15H16ClN3O5S2
Mol. Mass.:
417.888
SMILES:
NS(=O)(=O)c1ccc(CCNC(=O)c2ccc(Cl)c(c2)S(N)(=O)=O)cc1
: