Target
Carbonic anhydrase 1
Ligand
BDBM50101333
Substrate
Meas. Tech.
ChEBML_47505
Ki
15±n/a nM
Citation
 Mincione, FStarnotti, MMenabuoni, LScozzafava, ACasini, ASupuran, CT Carbonic anhydrase inhibitors: 4-sulfamoyl-benzenecarboxamides and 4-chloro-3-sulfamoyl-benzenecarboxamides with strong topical antiglaucoma properties. Bioorg Med Chem Lett 11:1787-91 (2001)  
Target
Name:
Carbonic anhydrase 1
Synonyms:
CA-I CAB Carbonate dehydratase I Carbonic anhydrase 1 (CA I) Carbonic anhydrase 1 (Recombinant CA I) Carbonic anhydrase B Carbonic anhydrase I (CA I) Carbonic anhydrase I (CAI) Carbonic anhydrase isoenzyme I (hCA I) | hCA
Type:
Enzyme
Mol. Mass.:
28873.37
Organism:
Homo sapiens (Human)
Description:
P00915
Residue:
261
  
Inhibitor
Name:
BDBM50101333
Synonyms:
4-Chloro-N-(5-mercapto-[1,3,4]thiadiazol-2-yl)-3-sulfamoyl-benzamide | CHEMBL53407
Type:
Small organic molecule
Emp. Form.:
C9H7ClN4O3S3
Mol. Mass.:
350.825
SMILES:
NS(=O)(=O)c1cc(ccc1Cl)C(=O)Nc1nnc(S)s1
: