Target
Carbonic anhydrase 2
Ligand
BDBM50101372
Substrate
Meas. Tech.
ChEBML_45058
Ki
16±n/a nM
Citation
 Mincione, FStarnotti, MMenabuoni, LScozzafava, ACasini, ASupuran, CT Carbonic anhydrase inhibitors: 4-sulfamoyl-benzenecarboxamides and 4-chloro-3-sulfamoyl-benzenecarboxamides with strong topical antiglaucoma properties. Bioorg Med Chem Lett 11:1787-91 (2001)  
Target
Name:
Carbonic anhydrase 2
Synonyms:
CA-II CAC Carbonate dehydratase II Carbonic anhydrase 2 (CA-II) Carbonic anhydrase C Carbonic anhydrase II (CA-II) Carbonic anhydrase II (hCA II) | Carbonic anhydrase isoenzyme II (hCA II)
Type:
Enzyme
Mol. Mass.:
29250.71
Organism:
Homo sapiens (Human)
Description:
P00918
Residue:
260
  
Inhibitor
Name:
BDBM50101372
Synonyms:
(S)-3-(3H-Imidazol-4-yl)-2-[3-(4-sulfamoyl-benzoylamino)-propionylamino]-propionic acid | CHEMBL50776
Type:
Small organic molecule
Emp. Form.:
C16H19N5O6S
Mol. Mass.:
409.417
SMILES:
NS(=O)(=O)c1ccc(cc1)C(=O)NCCC(=O)N[C@@H](Cc1cnc[nH]1)C(O)=O
: