Target
4-galactosyl-N-acetylglucosaminide 3-alpha-L-fucosyltransferase FUT5
Ligand
BDBM50101906
Substrate
Meas. Tech.
ChEBML_69264
IC50
>1000000±n/a nM
Citation
 Schuster, MBlechert, S Inhibition of fucosyltransferase V by a GDP-Azasugar. Bioorg Med Chem Lett 11:1809-11 (2001)  
Target
Name:
4-galactosyl-N-acetylglucosaminide 3-alpha-L-fucosyltransferase FUT5
Synonyms:
FUT5 Fucosyltransferase 5
Type:
PROTEIN
Mol. Mass.:
43016.71
Organism:
Homo sapiens (Human)
Description:
ChEMBL_69264
Residue:
374
  
Inhibitor
Name:
BDBM50101906
Synonyms:
CHEMBL53188 | GDP-Azasugar analogue
Type:
Small organic molecule
Emp. Form.:
C12H20N6O11P2
Mol. Mass.:
486.2683
SMILES:
[NH3+]CCOP([O-])(=O)OP([O-])(=O)OC[C@H]1O[C@H]([C@H](O)[C@@H]1O)n1cnc2c1nc([NH3+])[nH]c2=O
: