Target
Estrogen receptor
Ligand
BDBM23420
Substrate
Meas. Tech.
ChEMBL_67502 (CHEMBL679893)
IC50
6300±n/a nM
Citation
 Matsuda, HShimoda, HMorikawa, TYoshikawa, M Phytoestrogens from the roots of Polygonum cuspidatum (Polygonaceae): structure-requirement of hydroxyanthraquinones for estrogenic activity. Bioorg Med Chem Lett 11:1839-42 (2001)  
Target
Name:
Estrogen receptor
Synonyms:
ER ESR ESR1_HUMAN Estrogen receptor Estrogen receptor (ER-alpha) Estrogen receptor alpha (ER) Nuclear receptor subfamily 3 group A member 1
Type:
Protein
Mol. Mass.:
66230.44
Organism:
Homo sapiens (Human)
Description:
P03372
Residue:
595
  
Inhibitor
Name:
BDBM23420
Synonyms:
7,4′-Dihydroxy-isoflavone (3a) CHEMBL8145 US8552057, 7
Type:
isoflavone
Emp. Form.:
C15H10O4
Mol. Mass.:
254.2375
SMILES:
Oc1ccc(cc1)-c1coc2cc(O)ccc2c1=O
: