Target
Disintegrin and metalloproteinase domain-containing protein 17
Ligand
BDBM50103163
Substrate
Meas. Tech.
ChEBML_207330
IC50
23±n/a nM
Citation
 Levin, JIChen, JDu, MHogan, MKincaid, SNelson, FCVenkatesan, AMWehr, TZask, ADiJoseph, JKillar, LMSkala, SSung, ASharr, MRoth, CJin, GCowling, RMohler, KMBlack, RAMarch, CJSkotnicki, JS The discovery of anthranilic acid-based MMP inhibitors. Part 2: SAR of the 5-position and P1(1) groups. Bioorg Med Chem Lett 11:2189-92 (2001)  
Target
Name:
Disintegrin and metalloproteinase domain-containing protein 17
Synonyms:
ADA17_HUMAN CSVP Disintegrin and metalloproteinase domain-containing protein 17 (ADAM17) TNF-alpha convertase TNF-alpha-converting enzyme (TACE) Tumor necrosis factor-α converting enzyme (TACE)
Type:
Enzyme
Mol. Mass.:
93007.89
Organism:
Homo sapiens (Human)
Description:
Residue:
824
  
Inhibitor
Name:
BDBM50103163
Synonyms:
5-Bromo-N-hydroxy-3-methyl-2-{methyl-[4'-(thiazol-2-ylmethoxy)-biphenyl-4-sulfonyl]-amino}-benzamide | CHEMBL71227
Type:
Small organic molecule
Emp. Form.:
C25H22BrN3O5S2
Mol. Mass.:
588.493
SMILES:
CN(c1c(C)cc(Br)cc1C(=O)NO)S(=O)(=O)c1ccc(cc1)-c1ccc(OCc2nccs2)cc1
: