Target
Collagenase 3
Ligand
BDBM50103172
Substrate
Meas. Tech.
ChEBML_106636
IC50
26±n/a nM
Citation
 Levin, JIChen, JDu, MHogan, MKincaid, SNelson, FCVenkatesan, AMWehr, TZask, ADiJoseph, JKillar, LMSkala, SSung, ASharr, MRoth, CJin, GCowling, RMohler, KMBlack, RAMarch, CJSkotnicki, JS The discovery of anthranilic acid-based MMP inhibitors. Part 2: SAR of the 5-position and P1(1) groups. Bioorg Med Chem Lett 11:2189-92 (2001)  
Target
Name:
Collagenase 3
Synonyms:
MMP-13 MMP13_HUMAN Matrix metalloproteinase-13 (MMP-13) | Matrix metalloproteinase-13 (MMP13)
Type:
Enzyme
Mol. Mass.:
53808.06
Organism:
Homo sapiens (Human)
Description:
P45452
Residue:
471
  
Inhibitor
Name:
BDBM50103172
Synonyms:
2-[(4-Benzo[1,3]dioxol-5-yl-benzenesulfonyl)-pyridin-3-ylmethyl-amino]-N-hydroxy-3-methyl-benzamide | CHEMBL69048
Type:
Small organic molecule
Emp. Form.:
C27H23N3O6S
Mol. Mass.:
517.553
SMILES:
Cc1cccc(C(=O)NO)c1N(Cc1cccnc1)S(=O)(=O)c1ccc(cc1)-c1ccc2OCOc2c1
: