Target
Matrix metalloproteinase-9
Ligand
BDBM50103157
Substrate
Meas. Tech.
ChEBML_105532
IC50
46±n/a nM
Citation
 Levin, JIChen, JDu, MHogan, MKincaid, SNelson, FCVenkatesan, AMWehr, TZask, ADiJoseph, JKillar, LMSkala, SSung, ASharr, MRoth, CJin, GCowling, RMohler, KMBlack, RAMarch, CJSkotnicki, JS The discovery of anthranilic acid-based MMP inhibitors. Part 2: SAR of the 5-position and P1(1) groups. Bioorg Med Chem Lett 11:2189-92 (2001)  
Target
Name:
Matrix metalloproteinase-9
Synonyms:
67 kDa matrix metalloproteinase-9 92 kDa gelatinase CLG4B Gelatinase B MMP9 Matrix metalloproteinase 9 (MMP-9) Matrix metalloproteinase-9 (MMP9)
Type:
Enzyme
Mol. Mass.:
78452.28
Organism:
Homo sapiens (Human)
Description:
P14780
Residue:
707
  
Inhibitor
Name:
BDBM50103157
Synonyms:
2-[Benzyl-(4-phenethyloxy-benzenesulfonyl)-amino]-N-hydroxy-3,5-dimethyl-benzamide | CHEMBL71007
Type:
Small organic molecule
Emp. Form.:
C30H30N2O5S
Mol. Mass.:
530.635
SMILES:
Cc1cc(C)c(N(Cc2ccccc2)S(=O)(=O)c2ccc(OCCc3ccccc3)cc2)c(c1)C(=O)NO
: