Target
Acetylcholinesterase
Ligand
BDBM50199518
Substrate
Meas. Tech.
ChEBML_27825
Ki
794±n/a nM
Citation
 Rajendran, VSaxena, ADoctor, BPKozikowski, AP Synthesis of more potent analogues of the acetylcholinesterase inhibitor, huperzine B. Bioorg Med Chem Lett 12:1521-3 (2002)  
Target
Name:
Acetylcholinesterase
Synonyms:
ACES_BOVIN Acetylcholinesterase (AChE) | Acetylcholinesterase precursor
Type:
Enzyme
Mol. Mass.:
67659.62
Organism:
Bos taurus (bovine)
Description:
Residue:
613
  
Inhibitor
Name:
BDBM50199518
Synonyms:
(-)-huperzine B huperzine B
Type:
Small organic molecule
Emp. Form.:
C16H20N2O
Mol. Mass.:
256.3428
SMILES:
CC1=C[C@H]2Cc3[nH]c(=O)ccc3[C@]3(C1)NCCC[C@H]23
: