Target
Prothrombin
Ligand
BDBM50111101
Substrate
Meas. Tech.
ChEBML_208337
Ki
0.003000±n/a nM
Citation
 Lee, KJung, WHPark, CWPark, HDLee, SHKwon, OH Noncovalent tripeptidic thrombin inhibitors incorporating amidrazone, amine and amidine functions at P1. Bioorg Med Chem Lett 12:1017-22 (2002)  
Target
Name:
Prothrombin
Synonyms:
Activation peptide fragment 1 Coagulation factor II Prothrombin precursor Thrombin heavy chain | Thrombin light chain
Type:
Protein
Mol. Mass.:
70029.57
Organism:
Homo sapiens (Human)
Description:
P00734
Residue:
622
  
Inhibitor
Name:
BDBM50111101
Synonyms:
(S)-1-((R)-2-Methanesulfonylamino-3,3-diphenyl-propionyl)-pyrrolidine-2-carboxylic acid 4-carbamimidoyl-benzylamide CHEMBL269575
Type:
Small organic molecule
Emp. Form.:
C29H33N5O4S
Mol. Mass.:
547.668
SMILES:
CS(=O)(=O)N[C@H](C(c1ccccc1)c1ccccc1)C(=O)N1CCC[C@H]1C(=O)NCc1ccc(cc1)C(N)=N
: