Target
Melanocyte-stimulating hormone receptor
Ligand
BDBM50451531
Substrate
Meas. Tech.
ChEBML_106680
EC50
1950±n/a nM
Citation
 Cheung, AWDanho, WSwistok, JQi, LKurylko, GRowan, KYeon, MFranco, LChu, XJChen, LYagaloff, K Structure-activity relationship of linear peptide Bu-His-DPhe-Arg-Trp-Gly-NH(2) at the human melanocortin-1 and -4 receptors: histidine substitution. Bioorg Med Chem Lett 13:133-7 (2002)  
Target
Name:
Melanocyte-stimulating hormone receptor
Synonyms:
MC1-R MSH-R MSHR_HUMAN Melanocortin receptor (M1 and M4) Melanocortin receptor 1 (MC1-R) | Melanocortin receptor 1 (MC1R)
Type:
Enzyme
Mol. Mass.:
34717.23
Organism:
Homo sapiens (Human)
Description:
Q01726
Residue:
317
  
Inhibitor
Name:
BDBM50451531
Synonyms:
CHEMBL2112064
Type:
Small organic molecule
Emp. Form.:
C44H56N10O6
Mol. Mass.:
820.9788
SMILES:
CCCCC(=O)N[C@@]1(CCc2ccccc2C1)C(=O)N[C@H](Cc1ccccc1)C(=O)N[C@@H](CCCN=C(N)N)C(=O)N[C@@H](Cc1c[nH]c2ccccc12)C(=O)NCC(N)=O
: